Reaction Details
TargetD(3) dopamine receptor
LigandBDBM141768
Substrate/Competitorn/a
Meas. Tech.Radioligand Binding Assay
Ki 0.68±n/a nM
Citation Rodriguez Sarmiento, RMWichmann, J Benzofurane-piperidine compounds US Patent US8921397 Publication Date 12/30/2014
 
D(3) dopamine receptor
Name:D(3) dopamine receptor
Type:n/a
Mol. Mass.:44243.43
Organism:Homo sapiens (Human)
Description:n/a
Residue:400
BDBM141768
NameBDBM141768
Synonyms:US8921397, 10
TypeSmall organic molecule
Emp. Form.C27H35N3O3
Mol. Mass.449.5851
SMILESCc1cc(CC(=O)N[C@H]2CC[C@H](CCN3CCC(CC3)c3coc4ccccc34)CC2)on1