Reaction Details
TargetIntegrin alpha-IIb
LigandBDBM141981
Substrate/Competitorn/a
Meas. Tech.Binding Assay
pH9.6±n/a
Temperature277.15±n/a K
IC50>1000±n/a nM
Commentsextracted
Citation Zischinsky, GStragies, ROsterkamp, FScharn, DHummel, GKalkhof, HZahn, GVossmeyer, DChristner-Albrecht, CReineke, U Compounds for the inhibition of integrins and use thereof US Patent US8927534 Publication Date 1/6/2015
 
Integrin alpha-IIb
Name:Integrin alpha-IIb
Type:Protein
Mol. Mass.:113354.85
Organism:Homo sapiens (Human)
Description:P08514
Residue:1039
BDBM141981
NameBDBM141981
Synonyms:US8927534, 120
TypeSmall organic molecule
Emp. Form.C30H35FN4O3
Mol. Mass.518.6223
SMILESCCc1cc(F)cc(C)c1C(=O)NC(Cc1ccc(cc1)N1CCC(CNc2ccccn2)CC1)C(O)=O