Reaction Details
TargetPro-glucagon
LigandBDBM142035
Substrate/Competitorn/a
Meas. Tech.SPA Assay
pH7.4±n/a
Ki 91±n/a nM
Citation Didiuk, MFilipski, KJGuzman-Perez, ALee, ECPfefferkorn, JAStevens, BTu, M Quinolinyl glucagon receptor modulators US Patent US8927577 Publication Date 1/6/2015
 
Pro-glucagon
Name:Pro-glucagon
Type:Enzyme
Mol. Mass.:20907.95
Organism:Homo sapiens (Human)
Description:P01275
Residue:180
BDBM142035
NameBDBM142035
Synonyms:US8927577, 16
TypeSmall organic molecule
Emp. Form.C25H26F3N3O3
Mol. Mass.473.4874
SMILESCC(C)CC(Nc1ccc2cc(ccc2n1)C(F)(F)F)c1ccc(cc1)C(=O)NCCC(O)=O