Reaction Details
TargetCoagulation factor XI
LigandBDBM285860
Substrate/Competitorn/a
Meas. Tech.Factor XIa Assay
pH7.4±n/a
IC50 0.320±n/a nM
Commentsextracted
Citation Mertz, EEdmondson, SDSo, SSun, WLiu, WNeelamkavil, SFGao, YHruza, AZang, YAli, AMal, RHe, JKuang, RWu, HOgawa, AKNolting, AF Factor XIa inhibitors US Patent US10081617 Publication Date 9/25/2018
 
Coagulation factor XI
Name:Coagulation factor XI
Type:Enzyme
Mol. Mass.:70130.58
Organism:Homo sapiens (Human)
Description:P03951
Residue:625
BDBM285860
NameBDBM285860
Synonyms:US10081617, Example 9
TypeSmall organic molecule
Emp. Form.C26H20Cl2N8O4
Mol. Mass.579.394
SMILESCOC(=O)Nc1ccc(cc1)-c1nc([nH]c1Cl)[C@@]1(O)CCc2cc(c[n+]([O-])c12)-c1cc(Cl)ccc1-n1cnnn1