Reaction Details
TargetCoagulation factor XI
LigandBDBM285969
Substrate/Competitorn/a
Meas. Tech.Factor XIa Assay
pH7.4±n/a
IC50 0.610±n/a nM
Commentsextracted
Citation Mertz, EEdmondson, SDSo, SSun, WLiu, WNeelamkavil, SFGao, YHruza, AZang, YAli, AMal, RHe, JKuang, RWu, HOgawa, AKNolting, AF Factor XIa inhibitors US Patent US10081617 Publication Date 9/25/2018
 
Coagulation factor XI
Name:Coagulation factor XI
Type:Enzyme
Mol. Mass.:70130.58
Organism:Homo sapiens (Human)
Description:P03951
Residue:625
BDBM285969
NameBDBM285969
Synonyms:US10081617, Example 116 methyl (4-{5-chloro-2-[3-(5- chloro-2-cyanophenyl)-7- hydroxy-4-methoxy-1-oxido- 6,7-dihydro-5H- cyclopenta[b]pyridin-7-yl]-1H- imidazol-4- yl}phenyl)carbamate
TypeSmall organic molecule
Emp. Form.C27H21Cl2N5O5
Mol. Mass.566.392
SMILESCOC(=O)Nc1ccc(cc1)-c1nc([nH]c1Cl)C1(O)CCc2c1[n+]([O-])cc(c2OC)-c1cc(Cl)ccc1C#N