Reaction Details
TargetKynurenine/alpha-aminoadipate aminotransferase, mitochondrial
LigandBDBM50432200
Substrate/Competitorn/a
Meas. Tech.Inhibition Spectra Assay
Temperature310.15±n/a K
IC50 85±n/a nM
Commentsextracted
Citation Dounay, ABMcAllister, LAParikh, VDRong, SVerhoest, PR KAT II inhibitors US Patent US8933095 Publication Date 1/13/2015
 
Kynurenine/alpha-aminoadipate aminotransferase, mitochondrial
Name:Kynurenine/alpha-aminoadipate aminotransferase, mitochondrial
Type:Enzyme
Mol. Mass.:47353.09
Organism:Homo sapiens (Human)
Description:Q8N5Z0
Residue:425
BDBM50432200
NameBDBM50432200
Synonyms:CHEMBL2347109 | US8933095, 16
TypeSmall organic molecule
Emp. Form.C12H12N4O2
Mol. Mass.244.2493
SMILESN[C@H]1Cc2nn(cc2N(O)C1=O)-c1ccccc1