Reaction Details
TargetKynurenine/alpha-aminoadipate aminotransferase, mitochondrial
LigandBDBM107738
Substrate/Competitorn/a
Meas. Tech.Inhibition Spectra Assay
Temperature310.15±n/a K
IC50 65.6±n/a nM
Commentsextracted
Citation Dounay, ABMcAllister, LAParikh, VDRong, SVerhoest, PR KAT II inhibitors US Patent US8933095 Publication Date 1/13/2015
 
Kynurenine/alpha-aminoadipate aminotransferase, mitochondrial
Name:Kynurenine/alpha-aminoadipate aminotransferase, mitochondrial
Type:Enzyme
Mol. Mass.:47353.09
Organism:Homo sapiens (Human)
Description:Q8N5Z0
Residue:425
BDBM107738
NameBDBM107738
Synonyms:CHEMBL2347113 | US8933095, 22
TypeSmall organic molecule
Emp. Form.C15H18N4O3
Mol. Mass.302.3284
SMILESCOc1cccc(Cc2nn(C)c3N(O)C(=O)[C@@H](N)Cc23)c1