Reaction Details
TargetcAMP and cAMP-inhibited cGMP 3',5'-cyclic phosphodiesterase 10A
LigandBDBM142410
Substrate/Competitorn/a
Meas. Tech.Inhibition Assay
Temperature298.15±n/a K
IC50 0.34±n/a nM
Commentsextracted
Citation Puschl, ANielsen, JKehler, JKilburn, JPMarigo, MLanggard, M 2-arylimidazole derivatives as PDE10A enzyme inhibitors US Patent US8927738 Publication Date 1/6/2015
 
cAMP and cAMP-inhibited cGMP 3',5'-cyclic phosphodiesterase 10A
Name:cAMP and cAMP-inhibited cGMP 3',5'-cyclic phosphodiesterase 10A
Type:Protein
Mol. Mass.:88412.52
Organism:Homo sapiens (Human)
Description:Q9Y233
Residue:779
BDBM142410
NameBDBM142410
Synonyms:US8927738, 5,8-Dimethyl-2-[2-(2-thiophen-2-yl-1H-imidazol-4-yl)-ethyl]-[1,2,4]triazolo[1,5-a]pyridine
TypeSmall organic molecule
Emp. Form.C17H17N5S
Mol. Mass.323.415
SMILESCc1ccc(C)n2nc(CCc3c[nH]c(n3)-c3cccs3)nc12