Reaction Details
TargetMitogen-activated protein kinase 14
LigandBDBM142629
Substrate/Competitorn/a
Meas. Tech.Fluorescence Resonance Energy Transfer (FRET) Assay
IC50 2±n/a nM
Citation Murray, PJOnions, STWilliams, JGJoly, K Respiratory formulations and compounds for use therein US Patent US8933228 Publication Date 1/13/2015
 
Mitogen-activated protein kinase 14
Name:Mitogen-activated protein kinase 14
Type:Serine/threonine-protein kinase
Mol. Mass.:41286.76
Organism:Homo sapiens (Human)
Description:Q16539
Residue:360
BDBM142629
NameBDBM142629
Synonyms:US8933228, 21
TypeSmall organic molecule
Emp. Form.C30H27N7O3S
Mol. Mass.565.645
SMILESCc1ccc(s1)-n1nc(cc1NC(=O)Nc1ccc(Oc2ccnc3[nH]c(=O)cnc23)c2ccccc12)C(C)(C)C