Reaction Details
TargetMitogen-activated protein kinase 12
LigandBDBM142616
Substrate/Competitorn/a
Meas. Tech.Fluorescence Resonance Energy Transfer (FRET) Assay
IC50 89±n/a nM
Citation Murray, PJOnions, STWilliams, JGJoly, K Respiratory formulations and compounds for use therein US Patent US8933228 Publication Date 1/13/2015
 
Mitogen-activated protein kinase 12
Name:Mitogen-activated protein kinase 12
Type:Protein
Mol. Mass.:41938.69
Organism:Homo sapiens (Human)
Description:P53778
Residue:367
BDBM142616
NameBDBM142616
Synonyms:US8933228, 32
TypeSmall organic molecule
Emp. Form.C31H25Cl2N7O3
Mol. Mass.614.481
SMILESCC(C)(C)c1cc(NC(=O)Nc2ccc(Oc3ccnc4[nH]c(=O)cnc34)c3ccccc23)n(n1)-c1ccc(Cl)c(Cl)c1