Reaction Details
TargetTyrosine-protein kinase HCK
LigandBDBM142620
Substrate/Competitorn/a
Meas. Tech.Fluorescence Resonance Energy Transfer (FRET) Assay
IC50 5±n/a nM
Citation Murray, PJOnions, STWilliams, JGJoly, K Respiratory formulations and compounds for use therein US Patent US8933228 Publication Date 1/13/2015
 
Tyrosine-protein kinase HCK
Name:Tyrosine-protein kinase HCK
Type:Enzyme Catalytic Domain
Mol. Mass.:59600.18
Organism:Homo sapiens (Human)
Description:P08631
Residue:526
BDBM142620
NameBDBM142620
Synonyms:US8933228, 11
TypeSmall organic molecule
Emp. Form.C33H33N7O4
Mol. Mass.591.6596
SMILESCCn1c2c(Oc3ccc(NC(=O)Nc4cc(nn4-c4ccc(OC)cc4)C(C)(C)C)c4ccccc34)ccnc2[nH]c1=O