Reaction Details
TargetCasein kinase II subunit alpha
LigandBDBM142778
Substrate/Competitorn/a
Meas. Tech.Kinase Assay
pH7.4±n/a
Temperature303.15±n/a K
IC50 0.29±n/a nM
Commentsextracted
Citation Purandare, AVFink, BEGavai, AVJohnson, WLHart, ACHe, LHuynh, TNInghrim, JMastalerz, HSang, XTarby, CMWan, HVaccaro, WZhang, GZhao, YZimmermann, K Imidazotriazinecarbonitriles useful as kinase inhibitors US Patent US8940736 Publication Date 1/27/2015
 
Casein kinase II subunit alpha
Name:Casein kinase II subunit alpha
Type:Enzyme
Mol. Mass.:45151.12
Organism:Homo sapiens (Human)
Description:P68400
Residue:391
BDBM142778
NameBDBM142778
Synonyms:US8940736, 55
TypeSmall organic molecule
Emp. Form.C24H25ClN10O
Mol. Mass.504.975
SMILESClc1c(Nc2nc(NC3CC3)c3ncc(C#N)n3n2)cc(cc1N1CCN(CC1)C1CCOC1)C#N