Reaction Details
TargetCasein kinase II subunit alpha
LigandBDBM142829
Substrate/Competitorn/a
Meas. Tech.Kinase Assay
pH7.4±n/a
Temperature303.15±n/a K
IC50 0.13±n/a nM
Commentsextracted
Citation Purandare, AVFink, BEGavai, AVJohnson, WLHart, ACHe, LHuynh, TNInghrim, JMastalerz, HSang, XTarby, CMWan, HVaccaro, WZhang, GZhao, YZimmermann, K Imidazotriazinecarbonitriles useful as kinase inhibitors US Patent US8940736 Publication Date 1/27/2015
 
Casein kinase II subunit alpha
Name:Casein kinase II subunit alpha
Type:Enzyme
Mol. Mass.:45151.12
Organism:Homo sapiens (Human)
Description:P68400
Residue:391
BDBM142829
NameBDBM142829
Synonyms:US8940736, 391
TypeSmall organic molecule
Emp. Form.C19H15N13
Mol. Mass.425.4095
SMILESCc1nc(Nc2nc(Nc3ccc4n(C)nc(C#N)c4c3)nn3c(cnc23)[N+]#[C-])nn1C