Reaction Details
TargetCasein kinase II subunit alpha'
LigandBDBM142777
Substrate/Competitorn/a
Meas. Tech.Kinase Assay
pH7.4±n/a
Temperature303.15±n/a K
IC50 0.11±n/a nM
Commentsextracted
Citation Purandare, AVFink, BEGavai, AVJohnson, WLHart, ACHe, LHuynh, TNInghrim, JMastalerz, HSang, XTarby, CMWan, HVaccaro, WZhang, GZhao, YZimmermann, K Imidazotriazinecarbonitriles useful as kinase inhibitors US Patent US8940736 Publication Date 1/27/2015
 
Casein kinase II subunit alpha'
Name:Casein kinase II subunit alpha'
Type:Protein
Mol. Mass.:41223.82
Organism:Homo sapiens (Human)
Description:n/a
Residue:350
BDBM142777
NameBDBM142777
Synonyms:US8940736, 49
TypeSmall organic molecule
Emp. Form.C20H19ClN10O
Mol. Mass.450.884
SMILESClc1c(NN2CCOCC2)cc(cc1Nc1nc(NC2CC2)c2ncc(C#N)n2n1)C#N