Reaction Details
TargetCasein kinase II subunit alpha'
LigandBDBM142807
Substrate/Competitorn/a
Meas. Tech.Kinase Assay
pH7.4±n/a
Temperature303.15±n/a K
IC50 0.27±n/a nM
Commentsextracted
Citation Purandare, AVFink, BEGavai, AVJohnson, WLHart, ACHe, LHuynh, TNInghrim, JMastalerz, HSang, XTarby, CMWan, HVaccaro, WZhang, GZhao, YZimmermann, K Imidazotriazinecarbonitriles useful as kinase inhibitors US Patent US8940736 Publication Date 1/27/2015
 
Casein kinase II subunit alpha'
Name:Casein kinase II subunit alpha'
Type:Protein
Mol. Mass.:41223.82
Organism:Homo sapiens (Human)
Description:n/a
Residue:350
BDBM142807
NameBDBM142807
Synonyms:US8940736, 238
TypeSmall organic molecule
Emp. Form.C25H24ClN9O3
Mol. Mass.533.97
SMILESClc1c(Nc2nc(NC3CC3)c3ncc(C#N)n3n2)cc(cc1C1CCN(CC1)C(=O)OC1COC1)C#N