Reaction Details
TargetBeta-secretase 1
LigandBDBM143218
Substrate/Competitorn/a
Meas. Tech.Homogeneous Time-Resolved FRET Assay
pH5.01±n/a
Ki 0.949±n/a nM
Commentsextracted
Citation Scott, JDStamford, AWGilbert, EJCumming, JNIserloh, U Iminothiadiazine dioxide compounds as BACE inhibitors, compositions, and their use US Patent US8940748 Publication Date 1/27/2015
 
Beta-secretase 1
Name:Beta-secretase 1
Type:Protein
Mol. Mass.:55755.10
Organism:Homo sapiens (Human)
Description:P56817
Residue:501
BDBM143218
NameBDBM143218
Synonyms:US8940748, 34 US9687494, 34
TypeSmall organic molecule
Emp. Form.C17H17ClFN5O3S
Mol. Mass.425.865
SMILESCN1C(=N)N[C@@](C)(CS1(=O)=O)c1cc(NC(=O)c2ccc(Cl)cn2)ccc1F