Reaction Details
TargetTyrosine-protein kinase BTK
LigandBDBM143318
Substrate/Competitorn/a
Meas. Tech.HTRF Assay
IC50 0.83±n/a nM
Citation Bosanac, TDisalvo, DHoran, JCLiang, SZindell, RM Heteroaromatic compounds as BTK inhibitors US Patent US8940893 Publication Date 1/27/2015
 
Tyrosine-protein kinase BTK
Name:Tyrosine-protein kinase BTK
Type:Enzyme
Mol. Mass.:76289.95
Organism:Homo sapiens (Human)
Description:Q06187
Residue:659
BDBM143318
NameBDBM143318
Synonyms:US8940893, 3
TypeSmall organic molecule
Emp. Form.C27H24N6O2
Mol. Mass.464.5185
SMILESCC#CC(=O)N1CC2(CC(C2)n2nc(-c3ccc(Oc4ccccc4)cc3)c3c(N)ncnc23)C1