Reaction Details
TargetTyrosine-protein kinase BTK
LigandBDBM143321
Substrate/Competitorn/a
Meas. Tech.HTRF Assay
IC50 0.85±n/a nM
Citation Bosanac, TDisalvo, DHoran, JCLiang, SZindell, RM Heteroaromatic compounds as BTK inhibitors US Patent US8940893 Publication Date 1/27/2015
 
Tyrosine-protein kinase BTK
Name:Tyrosine-protein kinase BTK
Type:Enzyme
Mol. Mass.:76289.95
Organism:Homo sapiens (Human)
Description:Q06187
Residue:659
BDBM143321
NameBDBM143321
Synonyms:US8940893, 6
TypeSmall organic molecule
Emp. Form.C32H29FN8O2
Mol. Mass.576.6235
SMILESCn1c(Cc2ccccc2)ncc(-c2ccc(-c3nn(C4CC5(C4)CN(C5)C(=O)C=C)c4ncnc(N)c34)c(F)c2)c1=O