Reaction Details
TargetTyrosine-protein kinase BTK
LigandBDBM143327
Substrate/Competitorn/a
Meas. Tech.HTRF Assay
IC50 1±n/a nM
Citation Bosanac, TDisalvo, DHoran, JCLiang, SZindell, RM Heteroaromatic compounds as BTK inhibitors US Patent US8940893 Publication Date 1/27/2015
 
Tyrosine-protein kinase BTK
Name:Tyrosine-protein kinase BTK
Type:Enzyme
Mol. Mass.:76289.95
Organism:Homo sapiens (Human)
Description:Q06187
Residue:659
BDBM143327
NameBDBM143327
Synonyms:US8940893, 12
TypeSmall organic molecule
Emp. Form.C26H23N7O2
Mol. Mass.465.5065
SMILESCC#CC(=O)N1CC2(CC(C2)n2nc(-c3ccc(Oc4ccccc4)cn3)c3c(N)ncnc23)C1