Reaction Details
TargetTransient receptor potential cation channel subfamily V member 1
LigandBDBM143834
Substrate/Competitorn/a
Meas. Tech.Activation Assay
IC50 4±n/a nM
Citation Dart, MJKym, PRVoight, EAShrestha, ADaanen, JFJinkerson, TKKeddy, RGPeddi, SGomtsyan, AKort, MEGfesser, GAWoller, KRNelson, DW TRPV1 antagonists US Patent US8969325 Publication Date 3/3/2015
 
Transient receptor potential cation channel subfamily V member 1
Name:Transient receptor potential cation channel subfamily V member 1
Type:Protein
Mol. Mass.:94960.75
Organism:Homo sapiens (Human)
Description:Q8NER1
Residue:839
BDBM143834
NameBDBM143834
Synonyms:US8969325, 35
TypeSmall organic molecule
Emp. Form.C20H18F3N3O2
Mol. Mass.389.371
SMILESFC(F)(F)c1ccc2[C@@H](CCc2c1)NC(=O)Nc1ccc2CCC(=O)Nc2c1