Reaction Details
TargetTransient receptor potential cation channel subfamily V member 1
LigandBDBM143965
Substrate/Competitorn/a
Meas. Tech.Activation Assay
IC50 1±n/a nM
Citation Dart, MJKym, PRVoight, EAShrestha, ADaanen, JFJinkerson, TKKeddy, RGPeddi, SGomtsyan, AKort, MEGfesser, GAWoller, KRNelson, DW TRPV1 antagonists US Patent US8969325 Publication Date 3/3/2015
 
Transient receptor potential cation channel subfamily V member 1
Name:Transient receptor potential cation channel subfamily V member 1
Type:Protein
Mol. Mass.:94960.75
Organism:Homo sapiens (Human)
Description:Q8NER1
Residue:839
BDBM143965
NameBDBM143965
Synonyms:US8969325, 166
TypeSmall organic molecule
Emp. Form.C21H21F3N4O3
Mol. Mass.434.4116
SMILESCN1C(=O)NCc2c(NC(=O)N[C@@H]3C[C@@](C)(Oc4ccccc34)C(F)(F)F)cccc12