Reaction Details
TargetTransient receptor potential cation channel subfamily V member 1
LigandBDBM143966
Substrate/Competitorn/a
Meas. Tech.Activation Assay
IC50 5±n/a nM
Citation Dart, MJKym, PRVoight, EAShrestha, ADaanen, JFJinkerson, TKKeddy, RGPeddi, SGomtsyan, AKort, MEGfesser, GAWoller, KRNelson, DW TRPV1 antagonists US Patent US8969325 Publication Date 3/3/2015
 
Transient receptor potential cation channel subfamily V member 1
Name:Transient receptor potential cation channel subfamily V member 1
Type:Protein
Mol. Mass.:94960.75
Organism:Homo sapiens (Human)
Description:Q8NER1
Residue:839
BDBM143966
NameBDBM143966
Synonyms:US8969325, 167
TypeSmall organic molecule
Emp. Form.C22H23ClF2N4O3
Mol. Mass.464.893
SMILESCN1Cc2c(NC(=O)N[C@@H]3CC(CF)(CF)Oc4cc(Cl)ccc34)cccc2N(C)C1=O