Reaction Details
TargetTransient receptor potential cation channel subfamily V member 1
LigandBDBM144122
Substrate/Competitorn/a
Meas. Tech.Activation Assay
IC50 4.5±n/a nM
Citation Dart, MJKym, PRVoight, EAShrestha, ADaanen, JFJinkerson, TKKeddy, RGPeddi, SGomtsyan, AKort, MEGfesser, GAWoller, KRNelson, DW TRPV1 antagonists US Patent US8969325 Publication Date 3/3/2015
 
Transient receptor potential cation channel subfamily V member 1
Name:Transient receptor potential cation channel subfamily V member 1
Type:Protein
Mol. Mass.:94960.75
Organism:Homo sapiens (Human)
Description:Q8NER1
Residue:839
BDBM144122
NameBDBM144122
Synonyms:US8969325, 323
TypeSmall organic molecule
Emp. Form.C20H18ClF2N3O4
Mol. Mass.437.824
SMILESFCC1(CF)C[C@@H](NC(=O)Nc2cccc3NC(=O)COc23)c2ccc(Cl)cc2O1