Reaction Details
TargetProstaglandin E synthase
LigandBDBM286069
Substrate/Competitorn/a
Meas. Tech.mPGES1 enzyme assay
IC50 2.18±n/a nM
Citation Li, XHe, WLiu, XWang, BHu, QJin, FDong, QSun, P Amide derivatives and pharmaceutically acceptable salts thereof, preparation method thereof and medicinal application thereof US Patent US10081629 Publication Date 9/25/2018
 
Prostaglandin E synthase
Name:Prostaglandin E synthase
Type:Protein
Mol. Mass.:17112.22
Organism:Homo sapiens (Human)
Description:n/a
Residue:152
BDBM286069
NameBDBM286069
Synonyms:2-Chloro-N-(3-oxo-2-(4-(trifluoromethyl)phenyl)isoindolin-5-yl)-5-((2,2-dimethyl-propanoyl)amino)methyl)-benzamide | US10081629, Example 58
TypeSmall organic molecule
Emp. Form.C28H25ClF3N3O3
Mol. Mass.543.965
SMILESCC(C)(C)C(=O)NCc1ccc(Cl)c(c1)C(=O)Nc1ccc2CN(C(=O)c2c1)c1ccc(cc1)C(F)(F)F