Reaction Details
TargetGamma-aminobutyric acid receptor subunit alpha-2
LigandBDBM144239
Substrate/Competitorn/a
Meas. Tech.Radioligand Competition Binding Assay
Ki 5.82±n/a nM
Citation Omoto, KOwen, RMPryde, DCWatson, CATakeuchi, M Chemical compounds US Patent US8952008 Publication Date 2/10/2015
 
Gamma-aminobutyric acid receptor subunit alpha-2
Name:Gamma-aminobutyric acid receptor subunit alpha-2
Type:Protein
Mol. Mass.:51338.78
Organism:Homo sapiens (Human)
Description:P47869
Residue:451
BDBM144239
NameBDBM144239
Synonyms:US8952008, 32
TypeSmall organic molecule
Emp. Form.C20H18FN5O2S
Mol. Mass.411.453
SMILESCC(C)n1cnc2c(cnnc12)-c1ccc(F)c(c1)-c1ccc(cc1)S(N)(=O)=O