Reaction Details
TargetProto-oncogene tyrosine-protein kinase ROS
LigandBDBM144326
Substrate/Competitorn/a
Meas. Tech.Inhibition Assay
IC50 0.51±n/a nM
Citation Shimada, IKurosawa, KMatsuya, TIikubo, KKondoh, YKamikawa, ATomiyama, HIwai, Y Diamino heterocyclic carboxamide compound US Patent US8969336 Publication Date 3/3/2015
 
Proto-oncogene tyrosine-protein kinase ROS
Name:Proto-oncogene tyrosine-protein kinase ROS
Type:Enzyme
Mol. Mass.:263897.39
Organism:Homo sapiens (Human)
Description:P08922
Residue:2347
BDBM144326
NameBDBM144326
Synonyms:US8969336, 570
TypeSmall organic molecule
Emp. Form.C31H45F3N8O2
Mol. Mass.618.7366
SMILESCC(C)c1nc(C(N)=O)c(Nc2ccc(N3CCC(CC3)N3CCN(C)CC3)c(c2)C(F)(F)F)nc1N[C@H]1CC[C@H](O)CC1