Reaction Details
TargetProto-oncogene tyrosine-protein kinase ROS
LigandBDBM144331
Substrate/Competitorn/a
Meas. Tech.Inhibition Assay
IC50 1.6±n/a nM
Citation Shimada, IKurosawa, KMatsuya, TIikubo, KKondoh, YKamikawa, ATomiyama, HIwai, Y Diamino heterocyclic carboxamide compound US Patent US8969336 Publication Date 3/3/2015
 
Proto-oncogene tyrosine-protein kinase ROS
Name:Proto-oncogene tyrosine-protein kinase ROS
Type:Enzyme
Mol. Mass.:263897.39
Organism:Homo sapiens (Human)
Description:P08922
Residue:2347
BDBM144331
NameBDBM144331
Synonyms:US8969336, 575
TypeSmall organic molecule
Emp. Form.C28H41ClN8O2
Mol. Mass.557.131
SMILESCN1CCN(CC1)C1CCN(CC1)c1ccc(Nc2nc(N[C@H]3CC[C@H](O)CC3)c(Cl)nc2C(N)=O)cc1C