Reaction Details
TargetProto-oncogene tyrosine-protein kinase ROS
LigandBDBM144317
Substrate/Competitorn/a
Meas. Tech.Inhibition Assay
IC50 0.58±n/a nM
Citation Shimada, IKurosawa, KMatsuya, TIikubo, KKondoh, YKamikawa, ATomiyama, HIwai, Y Diamino heterocyclic carboxamide compound US Patent US8969336 Publication Date 3/3/2015
 
Proto-oncogene tyrosine-protein kinase ROS
Name:Proto-oncogene tyrosine-protein kinase ROS
Type:Enzyme
Mol. Mass.:263897.39
Organism:Homo sapiens (Human)
Description:P08922
Residue:2347
BDBM144317
NameBDBM144317
Synonyms:US8969336, 550 | US8969336, 579
TypeSmall organic molecule
Emp. Form.C23H32FN7O2
Mol. Mass.457.5443
SMILESCCc1nc(C(N)=O)c(Nc2ccc(N3CCN(C)CC3)c(F)c2)nc1NC1CCOCC1