Reaction Details
TargetProto-oncogene tyrosine-protein kinase ROS
LigandBDBM144319
Substrate/Competitorn/a
Meas. Tech.Inhibition Assay
IC50 0.41±n/a nM
Citation Shimada, IKurosawa, KMatsuya, TIikubo, KKondoh, YKamikawa, ATomiyama, HIwai, Y Diamino heterocyclic carboxamide compound US Patent US8969336 Publication Date 3/3/2015
 
Proto-oncogene tyrosine-protein kinase ROS
Name:Proto-oncogene tyrosine-protein kinase ROS
Type:Enzyme
Mol. Mass.:263897.39
Organism:Homo sapiens (Human)
Description:P08922
Residue:2347
BDBM144319
NameBDBM144319
Synonyms:US8969336, 554 | US8969336, 581
TypeSmall organic molecule
Emp. Form.C24H35N7O2
Mol. Mass.453.5804
SMILESCC(C)c1nc(C(N)=O)c(Nc2ccc(cc2)N2CCN(C)CC2)nc1NC1CCOCC1