Reaction Details
TargetProstaglandin E2 receptor EP4 subtype
LigandBDBM50308133
Substrate/Competitorn/a
Meas. Tech.Binding Assay
pH6±n/a
Temperature298.15±n/a K
Ki 0.9±n/a nM
Commentsextracted
Citation Blouin, MBurch, JHan, YMellon, C Thiophenecarboxamide derivatives as EP4 receptor ligands US Patent US8969394 Publication Date 3/3/2015
 
Prostaglandin E2 receptor EP4 subtype
Name:Prostaglandin E2 receptor EP4 subtype
Type:Enzyme
Mol. Mass.:53134.53
Organism:Homo sapiens (Human)
Description:P35408
Residue:488
BDBM50308133
NameBDBM50308133
Synonyms:4-[(1R)-1-({[2,5-Dichloro-4-(3-chlorobenzyl)-3-thienyl]carbonyl}amino)ethyl]benzoic acid | CHEMBL591431
TypeSmall organic molecule
Emp. Form.C21H16Cl3NO3S
Mol. Mass.468.781
SMILESC[C@@H](NC(=O)c1c(Cl)sc(Cl)c1Cc1cccc(Cl)c1)c1ccc(cc1)C(O)=O