Reaction Details
TargetTyrosine-protein kinase SYK
LigandBDBM144463
Substrate/Competitorn/a
Meas. Tech.Kinase Glo Luminescence Kinase Assay
IC50 0.7±n/a nM
Citation Hoffmann, MDahmann, GFiegen, DHandschuh, SKlicic, JLinz, GSchaenzle, GSchnapp, AEast, SPMazanetz, MPScott, RJWalker, E Substituted naphthyridines and their use as medicaments US Patent US8969568 Publication Date 3/3/2015
 
Tyrosine-protein kinase SYK
Name:Tyrosine-protein kinase SYK
Type:Enzyme
Mol. Mass.:72079.99
Organism:Homo sapiens (Human)
Description:P43405
Residue:635
BDBM144463
NameBDBM144463
Synonyms:US8969568, 14
TypeSmall organic molecule
Emp. Form.C21H19F2N3O3
Mol. Mass.399.3907
SMILESCOc1c(F)cc(cc1F)-c1cc2ncccc2c(O[C@H](C)[C@H]2CNC(=O)C2)n1