Reaction Details
TargetTyrosine-protein kinase SYK
LigandBDBM144476
Substrate/Competitorn/a
Meas. Tech.Kinase Glo Luminescence Kinase Assay
IC50 1.2±n/a nM
Citation Hoffmann, MDahmann, GFiegen, DHandschuh, SKlicic, JLinz, GSchaenzle, GSchnapp, AEast, SPMazanetz, MPScott, RJWalker, E Substituted naphthyridines and their use as medicaments US Patent US8969568 Publication Date 3/3/2015
 
Tyrosine-protein kinase SYK
Name:Tyrosine-protein kinase SYK
Type:Enzyme
Mol. Mass.:72079.99
Organism:Homo sapiens (Human)
Description:P43405
Residue:635
BDBM144476
NameBDBM144476
Synonyms:US8969568, 27
TypeSmall organic molecule
Emp. Form.C21H21N3O6
Mol. Mass.411.4079
SMILESCOc1cc(cc(OC)c1OC)-c1cc2ncccc2c(OC[C@H]2CNC(=O)O2)n1