Reaction Details
TargetTyrosine-protein kinase SYK
LigandBDBM144518
Substrate/Competitorn/a
Meas. Tech.Kinase Glo Luminescence Kinase Assay
IC50 0.2±n/a nM
Citation Hoffmann, MDahmann, GFiegen, DHandschuh, SKlicic, JLinz, GSchaenzle, GSchnapp, AEast, SPMazanetz, MPScott, RJWalker, E Substituted naphthyridines and their use as medicaments US Patent US8969568 Publication Date 3/3/2015
 
Tyrosine-protein kinase SYK
Name:Tyrosine-protein kinase SYK
Type:Enzyme
Mol. Mass.:72079.99
Organism:Homo sapiens (Human)
Description:P43405
Residue:635
BDBM144518
NameBDBM144518
Synonyms:US8969568, 71
TypeSmall organic molecule
Emp. Form.C22H20F3N3O4
Mol. Mass.447.4071
SMILESCOc1ccc(cc1OC)-c1cc2ncccc2c(O[C@@H]([C@H]2CNC(=O)C2)C(F)(F)F)n1