Reaction Details
TargetTyrosine-protein kinase SYK
LigandBDBM144549
Substrate/Competitorn/a
Meas. Tech.Kinase Glo Luminescence Kinase Assay
IC50 0.9±n/a nM
Citation Hoffmann, MDahmann, GFiegen, DHandschuh, SKlicic, JLinz, GSchaenzle, GSchnapp, AEast, SPMazanetz, MPScott, RJWalker, E Substituted naphthyridines and their use as medicaments US Patent US8969568 Publication Date 3/3/2015
 
Tyrosine-protein kinase SYK
Name:Tyrosine-protein kinase SYK
Type:Enzyme
Mol. Mass.:72079.99
Organism:Homo sapiens (Human)
Description:P43405
Residue:635
BDBM144549
NameBDBM144549
Synonyms:US8969568, 102
TypeSmall organic molecule
Emp. Form.C26H29N3O5
Mol. Mass.463.5256
SMILESCOc1cc(ccc1OCC1CCOCC1)-c1cc2ncccc2c(OC[C@H]2CNC(=O)C2)n1