Reaction Details
TargetSteroid 17-alpha-hydroxylase/17,20 lyase
LigandBDBM144623
Substrate/Competitorn/a
Meas. Tech.SPA Assay
pH7.2±n/a
Temperature298.15±n/a K
IC50 3.9±n/a nM
Commentsextracted
Citation Balog, JAHuang, A Substituted bicyclic heteroaryl compounds US Patent US8969586 Publication Date 3/3/2015
 
Steroid 17-alpha-hydroxylase/17,20 lyase
Name:Steroid 17-alpha-hydroxylase/17,20 lyase
Type:Enzyme
Mol. Mass.:57382.42
Organism:Homo sapiens (Human)
Description:E.coli expressing human CYP17
Residue:508
BDBM144623
NameBDBM144623
Synonyms:US8969586, 86 | US9598436, 86
TypeSmall organic molecule
Emp. Form.C18H12FN3O
Mol. Mass.305.3058
SMILESCc1ccncc1-c1ccnc2c(noc12)-c1ccc(F)cc1