Reaction Details
TargetSomatostatin receptor type 2
LigandBDBM144737
Substrate/Competitorn/a
Meas. Tech.Radioligand Binding Assay
pH7.6±n/a
Temperature298.15±n/a K
Ki 0.04±n/a nM
Commentsextracted
Citation Dong, ZXShen, YKim, SH Somatostatin-dopamine chimeric analogs US Patent US8952128 Publication Date 2/10/2015
 
Somatostatin receptor type 2
Name:Somatostatin receptor type 2
Type:Enzyme
Mol. Mass.:41344.94
Organism:Homo sapiens (Human)
Description:P30874
Residue:369
BDBM144737
NameBDBM144737
Synonyms:US8952128, 1
TypeSmall organic molecule
Emp. Form.C78H101FN16O9
Mol. Mass.1425.7367
SMILESC[C@@H](O)[C@@H]1NC(=O)[C@H](CCCCN)NC(=O)[C@@H](Cc2c[nH]c3ccccc23)NC(=O)[C@H](Cc2ccccc2)NC(=O)[C@H](Cc2ccccc2)NC(=O)[C@H](CCCNC(N)=N)NC(=O)[C@@H](CCCCNC(=O)[C@H](Cc2ccc(F)cc2)NC1=O)NCCC[C@@H]1C[C@H]2[C@@H](Cc3c[nH]c4cccc2c34)N(C)C1