Reaction Details
TargetApoptosis regulator Bcl-2
LigandBDBM145170
Substrate/Competitorn/a
Meas. Tech.Time Resolved-Fluorescence Resonance Energy Transfer (TR-FRET) Assay
Temperature298.15±n/a K
Ki 0.015±n/a nM
Commentsextracted
Citation Ding, HDoherty, GAElmore, SWHexamer, LKunzer, ARPark, CSong, XSouers, AJSullivan, GMTao, ZWang, LWendt, MDCzabotar, PELessene, GLColman, PM Apoptosis-inducing agents for the treatment of cancer and immune and autoimmune diseases US Patent US8952157 Publication Date 2/10/2015
 
Apoptosis regulator Bcl-2
Name:Apoptosis regulator Bcl-2
Type:Homodimer or heterodimer
Mol. Mass.:26269.11
Organism:Homo sapiens (Human)
Description:P10415
Residue:239
BDBM145170
NameBDBM145170
Synonyms:US8952157, 361 | US9303025, 361
TypeSmall organic molecule
Emp. Form.C42H47BrClN7O8S
Mol. Mass.925.287
SMILESCC1(C)CCC(CN2CCN(CC2)c2ccc(C(=O)NS(=O)(=O)c3ccc(NCC4COCCO4)c(c3)[N+]([O-])=O)c(Oc3cnc(N)c(Br)c3)c2)=C(C1)c1ccc(Cl)cc1