Reaction Details
TargetApoptosis regulator Bcl-2
LigandBDBM145196
Substrate/Competitorn/a
Meas. Tech.Time Resolved-Fluorescence Resonance Energy Transfer (TR-FRET) Assay
Temperature298.15±n/a K
Ki<0.01±n/a nM
Commentsextracted
Citation Ding, HDoherty, GAElmore, SWHexamer, LKunzer, ARPark, CSong, XSouers, AJSullivan, GMTao, ZWang, LWendt, MDCzabotar, PELessene, GLColman, PM Apoptosis-inducing agents for the treatment of cancer and immune and autoimmune diseases US Patent US8952157 Publication Date 2/10/2015
 
Apoptosis regulator Bcl-2
Name:Apoptosis regulator Bcl-2
Type:Homodimer or heterodimer
Mol. Mass.:26269.11
Organism:Homo sapiens (Human)
Description:P10415
Residue:239
BDBM145196
NameBDBM145196
Synonyms:US8952157, 387 | US9303025, 387
TypeSmall organic molecule
Emp. Form.C42H47Cl2N7O8S
Mol. Mass.880.836
SMILESCC1(C)CC(=C(CN2CCN(CC2)c2ccc(C(=O)NS(=O)(=O)c3ccc(NCC4CCOCC4)c(c3)[N+]([O-])=O)c(Oc3cnc(N)c(Cl)c3)c2)CO1)c1ccc(Cl)cc1