Reaction Details
TargetSodium channel protein type 9 subunit alpha
LigandBDBM145244
Substrate/Competitorn/a
Meas. Tech.Radioligand Binding Assay
pH7.4±n/a
Temperature298.15±n/a K
IC50 13±n/a nM
Commentsextracted
Citation Andrez, JChowdhury, SDecker, SMDehnhardt, CMFocken, TGrimwood, MEHemeon, IWJia, QLi, JOrtwine, DFSafina, BSheng, TSun, SSutherlin, DPWilson, MSZenova, AY N-substituted benzamides and methods of use thereof US Patent US8952169 Publication Date 2/10/2015
 
Sodium channel protein type 9 subunit alpha
Name:Sodium channel protein type 9 subunit alpha
Type:Protein
Mol. Mass.:226375.97
Organism:Homo sapiens (Human)
Description:Q15858
Residue:1988
BDBM145244
NameBDBM145244
Synonyms:US8952169, 23 | US9771376, Example 23
TypeSmall organic molecule
Emp. Form.C21H27ClFNO4S
Mol. Mass.443.96
SMILESCC12CC3CC(C)(C1)CC(COc1cc(F)c(cc1Cl)C(=O)NS(C)(=O)=O)(C3)C2