Reaction Details
TargetSodium channel protein type 9 subunit alpha
LigandBDBM145281
Substrate/Competitorn/a
Meas. Tech.Radioligand Binding Assay
pH7.4±n/a
Temperature298.15±n/a K
IC50 1±n/a nM
Commentsextracted
Citation Andrez, JChowdhury, SDecker, SMDehnhardt, CMFocken, TGrimwood, MEHemeon, IWJia, QLi, JOrtwine, DFSafina, BSheng, TSun, SSutherlin, DPWilson, MSZenova, AY N-substituted benzamides and methods of use thereof US Patent US8952169 Publication Date 2/10/2015
 
Sodium channel protein type 9 subunit alpha
Name:Sodium channel protein type 9 subunit alpha
Type:Protein
Mol. Mass.:226375.97
Organism:Homo sapiens (Human)
Description:Q15858
Residue:1988
BDBM145281
NameBDBM145281
Synonyms:US8952169, 60 | US9771376, Example 60
TypeSmall organic molecule
Emp. Form.C22H28FNO4S
Mol. Mass.421.525
SMILESCS(=O)(=O)NC(=O)c1cc(C2CC2)c(OCC23CC4CC(CC(C4)C2)C3)cc1F