Reaction Details
TargetSodium channel protein type 9 subunit alpha
LigandBDBM145303
Substrate/Competitorn/a
Meas. Tech.Radioligand Binding Assay
pH7.4±n/a
Temperature298.15±n/a K
IC50 294±n/a nM
Commentsextracted
Citation Andrez, JChowdhury, SDecker, SMDehnhardt, CMFocken, TGrimwood, MEHemeon, IWJia, QLi, JOrtwine, DFSafina, BSheng, TSun, SSutherlin, DPWilson, MSZenova, AY N-substituted benzamides and methods of use thereof US Patent US8952169 Publication Date 2/10/2015
 
Sodium channel protein type 9 subunit alpha
Name:Sodium channel protein type 9 subunit alpha
Type:Protein
Mol. Mass.:226375.97
Organism:Homo sapiens (Human)
Description:Q15858
Residue:1988
BDBM145303
NameBDBM145303
Synonyms:US8952169, 82 | US9771376, Example 82
TypeSmall organic molecule
Emp. Form.C15H17ClF4N2O4S
Mol. Mass.432.818
SMILESCN(C)S(=O)(=O)NC(=O)c1cc(Cl)c(OCC2(CCC2)C(F)(F)F)cc1F