Reaction Details
TargetSodium channel protein type 9 subunit alpha
LigandBDBM47141
Substrate/Competitorn/a
Meas. Tech.Radioligand Binding Assay
pH7.4±n/a
Temperature298.15±n/a K
IC50 6±n/a nM
Commentsextracted
Citation Andrez, JChowdhury, SDecker, SMDehnhardt, CMFocken, TGrimwood, MEHemeon, IWJia, QLi, JOrtwine, DFSafina, BSheng, TSun, SSutherlin, DPWilson, MSZenova, AY N-substituted benzamides and methods of use thereof US Patent US8952169 Publication Date 2/10/2015
 
Sodium channel protein type 9 subunit alpha
Name:Sodium channel protein type 9 subunit alpha
Type:Protein
Mol. Mass.:226375.97
Organism:Homo sapiens (Human)
Description:Q15858
Residue:1988
BDBM47141
NameBDBM47141
Synonyms:US8952169, 185 | US8952169, 297
Typen/a
Emp. Form.C20H27FN2O4S
Mol. Mass.410.503
SMILESFc1cc(OCC2CCCCC2)c(cc1C(=O)NS(=O)(=O)N1CCC1)C1CC1