Reaction Details
TargetSodium channel protein type 9 subunit alpha
LigandBDBM145291
Substrate/Competitorn/a
Meas. Tech.Electrophysiological Assay
Temperature310.15±n/a K
IC50 36.8±n/a nM
Commentsextracted
Citation Andrez, JChowdhury, SDecker, SMDehnhardt, CMFocken, TGrimwood, MEHemeon, IWJia, QLi, JOrtwine, DFSafina, BSheng, TSun, SSutherlin, DPWilson, MSZenova, AY N-substituted benzamides and methods of use thereof US Patent US8952169 Publication Date 2/10/2015
 
Sodium channel protein type 9 subunit alpha
Name:Sodium channel protein type 9 subunit alpha
Type:Protein
Mol. Mass.:226375.97
Organism:Homo sapiens (Human)
Description:Q15858
Residue:1988
BDBM145291
NameBDBM145291
Synonyms:US8952169, 70 | US9771376, Example 70
TypeSmall organic molecule
Emp. Form.C21H26ClFN2O4S
Mol. Mass.456.959
SMILESFc1cc(OCC23CC4CC(CC(C4)C2)C3)c(Cl)cc1C(=O)NS(=O)(=O)N1CCC1