Reaction Details
TargetSodium channel protein type 9 subunit alpha
LigandBDBM145369
Substrate/Competitorn/a
Meas. Tech.Electrophysiological Assay
Temperature310.15±n/a K
IC50 1.4±n/a nM
Commentsextracted
Citation Andrez, JChowdhury, SDecker, SMDehnhardt, CMFocken, TGrimwood, MEHemeon, IWJia, QLi, JOrtwine, DFSafina, BSheng, TSun, SSutherlin, DPWilson, MSZenova, AY N-substituted benzamides and methods of use thereof US Patent US8952169 Publication Date 2/10/2015
 
Sodium channel protein type 9 subunit alpha
Name:Sodium channel protein type 9 subunit alpha
Type:Protein
Mol. Mass.:226375.97
Organism:Homo sapiens (Human)
Description:Q15858
Residue:1988
BDBM145369
NameBDBM145369
Synonyms:US8952169, 148 | US9771376, Example 148
TypeSmall organic molecule
Emp. Form.C24H30FNO4S
Mol. Mass.447.563
SMILESFc1cc(OCC23CC4CC(CC(C4)C2)C3)c(cc1C(=O)NS(=O)(=O)C1CC1)C1CC1