Reaction Details
TargetArachidonate 5-lipoxygenase-activating protein
LigandBDBM145650
Substrate/Competitorn/a
Meas. Tech.Homogeneous Time Resolved Fluorescence Assay
Ki 3.8±n/a nM
Citation Chai, WDvorak, CAEccles, WEdwards, JPGoldberg, SDKrawczuk, PJLebsack, ADLiu, JPippel, DJSales, ZSTanis, VMTichenor, MSWiener, JJ 1,2,6-substituted benzimidazoles as FLAP modulators US Patent US8952177 Publication Date 2/10/2015
 
Arachidonate 5-lipoxygenase-activating protein
Name:Arachidonate 5-lipoxygenase-activating protein
Type:Protein
Mol. Mass.:24212.61
Organism:Homo sapiens (Human)
Description:A0A087WW23
Residue:218
BDBM145650
NameBDBM145650
Synonyms:US8952177, 1 US8952177, 6 US9695149, 6
TypeSmall organic molecule
Emp. Form.C28H28BrN3O3
Mol. Mass.534.444
SMILESCc1ccc(COc2ccc3nc(C4CCCC[C@@H]4C(O)=O)n(Cc4ccc(Br)cc4)c3c2)nc1