Reaction Details
TargetArachidonate 5-lipoxygenase-activating protein
LigandBDBM145672
Substrate/Competitorn/a
Meas. Tech.Homogeneous Time Resolved Fluorescence Assay
Ki 4.3±n/a nM
Citation Chai, WDvorak, CAEccles, WEdwards, JPGoldberg, SDKrawczuk, PJLebsack, ADLiu, JPippel, DJSales, ZSTanis, VMTichenor, MSWiener, JJ 1,2,6-substituted benzimidazoles as FLAP modulators US Patent US8952177 Publication Date 2/10/2015
 
Arachidonate 5-lipoxygenase-activating protein
Name:Arachidonate 5-lipoxygenase-activating protein
Type:Protein
Mol. Mass.:24212.61
Organism:Homo sapiens (Human)
Description:A0A087WW23
Residue:218
BDBM145672
NameBDBM145672
Synonyms:US8952177, 26 US9695149, 26
TypeSmall organic molecule
Emp. Form.C29H27F4N3O4
Mol. Mass.557.536
SMILESCc1ccc(COc2ccc3nc([C@H]4CCCC[C@H]4C(O)=O)n(Cc4ccc(OC(F)(F)F)cc4F)c3c2)nc1