Reaction Details
TargetArachidonate 5-lipoxygenase-activating protein
LigandBDBM145740
Substrate/Competitorn/a
Meas. Tech.Homogeneous Time Resolved Fluorescence Assay
Ki 2.4±n/a nM
Citation Chai, WDvorak, CAEccles, WEdwards, JPGoldberg, SDKrawczuk, PJLebsack, ADLiu, JPippel, DJSales, ZSTanis, VMTichenor, MSWiener, JJ 1,2,6-substituted benzimidazoles as FLAP modulators US Patent US8952177 Publication Date 2/10/2015
 
Arachidonate 5-lipoxygenase-activating protein
Name:Arachidonate 5-lipoxygenase-activating protein
Type:Protein
Mol. Mass.:24212.61
Organism:Homo sapiens (Human)
Description:A0A087WW23
Residue:218
BDBM145740
NameBDBM145740
Synonyms:US8952177, 94 US9695149, 94
TypeSmall organic molecule
Emp. Form.C26H25BrF2N4O3
Mol. Mass.559.403
SMILESCn1ccc(COc2cc(F)c3nc([C@@H]4CCCC[C@@H]4C(O)=O)n(Cc4ccc(Br)cc4F)c3c2)n1