Reaction Details
TargetArachidonate 5-lipoxygenase-activating protein
LigandBDBM145811
Substrate/Competitorn/a
Meas. Tech.Homogeneous Time Resolved Fluorescence Assay
Ki 2.2±n/a nM
Citation Chai, WDvorak, CAEccles, WEdwards, JPGoldberg, SDKrawczuk, PJLebsack, ADLiu, JPippel, DJSales, ZSTanis, VMTichenor, MSWiener, JJ 1,2,6-substituted benzimidazoles as FLAP modulators US Patent US8952177 Publication Date 2/10/2015
 
Arachidonate 5-lipoxygenase-activating protein
Name:Arachidonate 5-lipoxygenase-activating protein
Type:Protein
Mol. Mass.:24212.61
Organism:Homo sapiens (Human)
Description:A0A087WW23
Residue:218
BDBM145811
NameBDBM145811
Synonyms:US8952177, 167 US9695149, 167
TypeSmall organic molecule
Emp. Form.C31H31F3N4O3
Mol. Mass.564.598
SMILESCc1ccc(COc2ccc3nc([C@@H]4CCCC[C@@H]4C(O)=O)n(Cc4ccc(cc4F)N4CC(F)(F)C4)c3c2)nc1