Reaction Details
TargetRibosomal protein S6 kinase alpha-3
LigandBDBM286078
Substrate/Competitorn/a
Meas. Tech.Radioisotope assay
IC50>10000±n/a nM
Citation Dunn, SEJayanthan, ANagireddy, JRAnnedi, SVan Drie, JHDaynard, TSHuynh, M Substituted tetrahydropyrido[3′,2′:4,5]pyrrolo[1,2-α]pyrazine-2-carboxamides as RSK inhibitors US Patent US10081632 Publication Date 9/25/2018
 
Ribosomal protein S6 kinase alpha-3
Name:Ribosomal protein S6 kinase alpha-3
Type:Serine/threonine-protein kinase
Mol. Mass.:83740.03
Organism:Homo sapiens (Human)
Description:The human RSK2 sequence differed from the Genbank entry NM_004586 at one residue, V45G. The protein was cloned and purified from baculovirus expression system.
Residue:740
BDBM286078
NameBDBM286078
Synonyms:1-Benzyl-N-(3-(morpholinomethyl)benzo[b]thiophen-5-yl)-1H-pyrazole-4-carboxamide US10758530, Compound 5 | US9771366, Compound 5
TypeSmall organic molecule
Emp. Form.C24H24N4O2S
Mol. Mass.432.538
SMILESO=C(Nc1ccc2scc(CN3CCOCC3)c2c1)c1cnn(Cc2ccccc2)c1