Reaction Details
TargetRibosomal protein S6 kinase alpha-3
LigandBDBM286084
Substrate/Competitorn/a
Meas. Tech.Radioisotope assay
IC50 94000±n/a nM
Citation Dunn, SEJayanthan, ANagireddy, JRAnnedi, SVan Drie, JHDaynard, TSHuynh, M Substituted tetrahydropyrido[3′,2′:4,5]pyrrolo[1,2-α]pyrazine-2-carboxamides as RSK inhibitors US Patent US10081632 Publication Date 9/25/2018
 
Ribosomal protein S6 kinase alpha-3
Name:Ribosomal protein S6 kinase alpha-3
Type:Serine/threonine-protein kinase
Mol. Mass.:83740.03
Organism:Homo sapiens (Human)
Description:The human RSK2 sequence differed from the Genbank entry NM_004586 at one residue, V45G. The protein was cloned and purified from baculovirus expression system.
Residue:740
BDBM286084
NameBDBM286084
Synonyms:(R)-1-benzyl-N-(4-methyl-1-oxo-1,2,3,4-tetrahydropyrazino[1,2-a]indol-7-yl)-1H-pyrazole-4-carboxamide US10081632, Compound 11 | US10758530, Compound 11
TypeSmall organic molecule
Emp. Form.C23H21N5O2
Mol. Mass.399.4451
SMILESC[C@@H]1CNC(=O)c2cc3ccc(NC(=O)c4cnn(Cc5ccccc5)c4)cc3n12